Reaction Details
TargetReverse transcriptase
LigandBDBM50075205
Substrate/Competitorn/a
Meas. Tech.ChEMBL_1473736 (CHEMBL3418042)
IC50 1900±n/a nM
Citation Vernekar, SKLiu, ZNagy, EMiller, LKirby, KAWilson, DJKankanala, JSarafianos, SGParniak, MAWang, Z Design, synthesis, biochemical, and antiviral evaluations of C6 benzyl and C6 biarylmethyl substituted 2-hydroxylisoquinoline-1,3-diones: dual inhibition against HIV reverse transcriptase-associated RNase H and polymerase with antiviral activities. J Med Chem58:651-64 (2015) 
 
Reverse transcriptase
Name:Reverse transcriptase
Synonyms:n/a
Type:Protein
Mol. Mass.:29598.37
Organism:Human immunodeficiency virus 1
Description:Q9WKE8
Residue:254
BDBM50075205
NameBDBM50075205
Synonyms:CHEMBL3414869
TypeSmall organic molecule
Emp. Form.C23H19NO4
Mol. Mass.373.4013
SMILESCOc1ccc(cc1)-c1ccc(Cc2ccc3C(=O)N(O)C(=O)Cc3c2)cc1