Reaction Details
TargetReverse transcriptase
LigandBDBM50075210
Substrate/Competitorn/a
Meas. Tech.ChEMBL_1473737 (CHEMBL3418254)
IC50 1500±n/a nM
Citation Vernekar, SKLiu, ZNagy, EMiller, LKirby, KAWilson, DJKankanala, JSarafianos, SGParniak, MAWang, Z Design, synthesis, biochemical, and antiviral evaluations of C6 benzyl and C6 biarylmethyl substituted 2-hydroxylisoquinoline-1,3-diones: dual inhibition against HIV reverse transcriptase-associated RNase H and polymerase with antiviral activities. J Med Chem58:651-64 (2015) 
 
Reverse transcriptase
Name:Reverse transcriptase
Synonyms:n/a
Type:Protein
Mol. Mass.:29598.37
Organism:Human immunodeficiency virus 1
Description:Q9WKE8
Residue:254
BDBM50075210
NameBDBM50075210
Synonyms:CHEMBL3414867
TypeSmall organic molecule
Emp. Form.C22H16FNO3
Mol. Mass.361.3657
SMILESON1C(=O)Cc2cc(Cc3ccc(cc3)-c3ccc(F)cc3)ccc2C1=O