Reaction Details
TargetReverse transcriptase
LigandBDBM50075206
Substrate/Competitorn/a
Meas. Tech.ChEMBL_1473737 (CHEMBL3418254)
IC50 500±n/a nM
Citation Vernekar, SKLiu, ZNagy, EMiller, LKirby, KAWilson, DJKankanala, JSarafianos, SGParniak, MAWang, Z Design, synthesis, biochemical, and antiviral evaluations of C6 benzyl and C6 biarylmethyl substituted 2-hydroxylisoquinoline-1,3-diones: dual inhibition against HIV reverse transcriptase-associated RNase H and polymerase with antiviral activities. J Med Chem58:651-64 (2015) 
 
Reverse transcriptase
Name:Reverse transcriptase
Synonyms:n/a
Type:Protein
Mol. Mass.:29598.37
Organism:Human immunodeficiency virus 1
Description:Q9WKE8
Residue:254
BDBM50075206
NameBDBM50075206
Synonyms:CHEMBL3414870
TypeSmall organic molecule
Emp. Form.C23H19NO5S
Mol. Mass.421.466
SMILESCS(=O)(=O)c1ccc(cc1)-c1ccc(Cc2ccc3C(=O)N(O)C(=O)Cc3c2)cc1