Reaction Details
TargetIntegrase
LigandBDBM50075207
Substrate/Competitorn/a
Meas. Tech.ChEMBL_1473740 (CHEMBL3418257)
IC50 3600±n/a nM
Citation Vernekar, SKLiu, ZNagy, EMiller, LKirby, KAWilson, DJKankanala, JSarafianos, SGParniak, MAWang, Z Design, synthesis, biochemical, and antiviral evaluations of C6 benzyl and C6 biarylmethyl substituted 2-hydroxylisoquinoline-1,3-diones: dual inhibition against HIV reverse transcriptase-associated RNase H and polymerase with antiviral activities. J Med Chem58:651-64 (2015) 
 
Integrase
Name:Integrase
Synonyms:pol
Type:PROTEIN
Mol. Mass.:32203.43
Organism:Human immunodeficiency virus 1
Description:ChEMBL_106649
Residue:288
BDBM50075207
NameBDBM50075207
Synonyms:CHEMBL3414871
TypeSmall organic molecule
Emp. Form.C22H18N2O5S
Mol. Mass.422.454
SMILESNS(=O)(=O)c1ccc(cc1)-c1ccc(Cc2ccc3C(=O)N(O)C(=O)Cc3c2)cc1