Reaction Details
TargetIntegrase
LigandBDBM50075221
Substrate/Competitorn/a
Meas. Tech.ChEMBL_1473740 (CHEMBL3418257)
IC50>100000±n/a nM
Citation Vernekar, SKLiu, ZNagy, EMiller, LKirby, KAWilson, DJKankanala, JSarafianos, SGParniak, MAWang, Z Design, synthesis, biochemical, and antiviral evaluations of C6 benzyl and C6 biarylmethyl substituted 2-hydroxylisoquinoline-1,3-diones: dual inhibition against HIV reverse transcriptase-associated RNase H and polymerase with antiviral activities. J Med Chem58:651-64 (2015) 
 
Integrase
Name:Integrase
Synonyms:pol
Type:PROTEIN
Mol. Mass.:32203.43
Organism:Human immunodeficiency virus 1
Description:ChEMBL_106649
Residue:288
BDBM50075221
NameBDBM50075221
Synonyms:CHEMBL3414873
TypeSmall organic molecule
Emp. Form.C22H15F2NO3
Mol. Mass.379.3562
SMILESON1C(=O)Cc2cc(Cc3ccc(cc3)-c3ccc(F)cc3F)ccc2C1=O