Reaction Details
TargetReverse transcriptase/RNaseH
LigandBDBM50075205
Substrate/Competitorn/a
Meas. Tech.ChEMBL_1473728 (CHEMBL3418034)
IC50 3100±n/a nM
Citation Vernekar, SKLiu, ZNagy, EMiller, LKirby, KAWilson, DJKankanala, JSarafianos, SGParniak, MAWang, Z Design, synthesis, biochemical, and antiviral evaluations of C6 benzyl and C6 biarylmethyl substituted 2-hydroxylisoquinoline-1,3-diones: dual inhibition against HIV reverse transcriptase-associated RNase H and polymerase with antiviral activities. J Med Chem58:651-64 (2015) 
 
Reverse transcriptase/RNaseH
Name:Reverse transcriptase/RNaseH
Type:PROTEIN
Mol. Mass.:65229.15
Organism:Human immunodeficiency virus 1
Description:ChEMBL_1473730
Residue:566
BDBM50075205
NameBDBM50075205
Synonyms:CHEMBL3414869
TypeSmall organic molecule
Emp. Form.C23H19NO4
Mol. Mass.373.4013
SMILESCOc1ccc(cc1)-c1ccc(Cc2ccc3C(=O)N(O)C(=O)Cc3c2)cc1