Reaction Details
TargetReverse transcriptase/RNaseH
LigandBDBM33410
Substrate/Competitorn/a
Meas. Tech.ChEMBL_1473759 (CHEMBL3418276)
IC50 1200±n/a nM
Citation Vernekar, SKLiu, ZNagy, EMiller, LKirby, KAWilson, DJKankanala, JSarafianos, SGParniak, MAWang, Z Design, synthesis, biochemical, and antiviral evaluations of C6 benzyl and C6 biarylmethyl substituted 2-hydroxylisoquinoline-1,3-diones: dual inhibition against HIV reverse transcriptase-associated RNase H and polymerase with antiviral activities. J Med Chem58:651-64 (2015) 
 
Reverse transcriptase/RNaseH
Name:Reverse transcriptase/RNaseH
Type:PROTEIN
Mol. Mass.:65229.15
Organism:Human immunodeficiency virus 1
Description:ChEMBL_1473730
Residue:566
BDBM33410
NameBDBM33410
Synonyms:CHEMBL16755 | N-hydroxyisoquinolinedione, 2
TypeSmall organic molecule
Emp. Form.C9H7NO3
Mol. Mass.177.1568
SMILESON1C(=O)Cc2ccccc2C1=O