Reaction Details
TargetReverse transcriptase/RNaseH
LigandBDBM50075218
Substrate/Competitorn/a
Meas. Tech.ChEMBL_1473759 (CHEMBL3418276)
IC50 1600±n/a nM
Citation Vernekar, SKLiu, ZNagy, EMiller, LKirby, KAWilson, DJKankanala, JSarafianos, SGParniak, MAWang, Z Design, synthesis, biochemical, and antiviral evaluations of C6 benzyl and C6 biarylmethyl substituted 2-hydroxylisoquinoline-1,3-diones: dual inhibition against HIV reverse transcriptase-associated RNase H and polymerase with antiviral activities. J Med Chem58:651-64 (2015) 
 
Reverse transcriptase/RNaseH
Name:Reverse transcriptase/RNaseH
Type:PROTEIN
Mol. Mass.:65229.15
Organism:Human immunodeficiency virus 1
Description:ChEMBL_1473730
Residue:566
BDBM50075218
NameBDBM50075218
Synonyms:CHEMBL3414863
TypeSmall organic molecule
Emp. Form.C16H11F2NO3
Mol. Mass.303.2602
SMILESON1C(=O)Cc2cc(Cc3ccc(F)cc3F)ccc2C1=O