Reaction Details
TargetReverse transcriptase/RNaseH
LigandBDBM50075220
Substrate/Competitorn/a
Meas. Tech.ChEMBL_1473729 (CHEMBL3418035)
IC50 2900±n/a nM
Citation Vernekar, SKLiu, ZNagy, EMiller, LKirby, KAWilson, DJKankanala, JSarafianos, SGParniak, MAWang, Z Design, synthesis, biochemical, and antiviral evaluations of C6 benzyl and C6 biarylmethyl substituted 2-hydroxylisoquinoline-1,3-diones: dual inhibition against HIV reverse transcriptase-associated RNase H and polymerase with antiviral activities. J Med Chem58:651-64 (2015) 
 
Reverse transcriptase/RNaseH
Name:Reverse transcriptase/RNaseH
Type:PROTEIN
Mol. Mass.:65229.15
Organism:Human immunodeficiency virus 1
Description:ChEMBL_1473730
Residue:566
BDBM50075220
NameBDBM50075220
Synonyms:CHEMBL3414872
TypeSmall organic molecule
Emp. Form.C23H18N2O4
Mol. Mass.386.4
SMILESNC(=O)c1ccc(cc1)-c1ccc(Cc2ccc3C(=O)N(O)C(=O)Cc3c2)cc1