Reaction Details
TargetReverse transcriptase
LigandBDBM50075209
Substrate/Competitorn/a
Meas. Tech.ChEMBL_1473736 (CHEMBL3418042)
IC50 1000±n/a nM
Citation Vernekar, SKLiu, ZNagy, EMiller, LKirby, KAWilson, DJKankanala, JSarafianos, SGParniak, MAWang, Z Design, synthesis, biochemical, and antiviral evaluations of C6 benzyl and C6 biarylmethyl substituted 2-hydroxylisoquinoline-1,3-diones: dual inhibition against HIV reverse transcriptase-associated RNase H and polymerase with antiviral activities. J Med Chem58:651-64 (2015) 
 
Reverse transcriptase
Name:Reverse transcriptase
Synonyms:n/a
Type:Protein
Mol. Mass.:29598.37
Organism:Human immunodeficiency virus 1
Description:Q9WKE8
Residue:254
BDBM50075209
NameBDBM50075209
Synonyms:CHEMBL3414865
TypeSmall organic molecule
Emp. Form.C22H17NO3
Mol. Mass.343.3753
SMILESON1C(=O)Cc2cc(Cc3ccc(cc3)-c3ccccc3)ccc2C1=O