Reaction Details
TargetP2X purinoceptor 7
LigandBDBM50075451
Substrate/Competitorn/a
Meas. Tech.ChEMBL_1473818 (CHEMBL3418717)
IC50 133±n/a nM
Citation Park, JHLee, GELee, SDHien, TTKim, SYang, JWCho, JHKo, HLim, SCKim, YGKang, KWKim, YC Discovery of novel 2,5-dioxoimidazolidine-based P2X(7) receptor antagonists as constrained analogues of KN62. J Med Chem58:2114-34 (2015) 
 
P2X purinoceptor 7
Name:P2X purinoceptor 7
Type:Protein
Mol. Mass.:68602.85
Organism:Homo sapiens (Human)
Description:Q99572
Residue:595
BDBM50075451
NameBDBM50075451
Synonyms:CHEMBL3415314
TypeSmall organic molecule
Emp. Form.C31H34N4O6S
Mol. Mass.590.69
SMILESO=C(C1CCCCC1)N1CCC(CC1)N1C(Cc2ccc(OS(=O)(=O)c3cccc4cnccc34)cc2)C(=O)NC1=O