Reaction Details
TargetP2X purinoceptor 7
LigandBDBM50230061
Substrate/Competitorn/a
Meas. Tech.ChEMBL_1473011 (CHEMBL3420661)
IC50 34±n/a nM
Citation Park, JHLee, GELee, SDHien, TTKim, SYang, JWCho, JHKo, HLim, SCKim, YGKang, KWKim, YC Discovery of novel 2,5-dioxoimidazolidine-based P2X(7) receptor antagonists as constrained analogues of KN62. J Med Chem58:2114-34 (2015) 
 
P2X purinoceptor 7
Name:P2X purinoceptor 7
Type:Protein
Mol. Mass.:68602.85
Organism:Homo sapiens (Human)
Description:Q99572
Residue:595
BDBM50230061
NameBDBM50230061
Synonyms:(S)-4-(3-(4-benzoylpiperazin-1-yl)-2-(benzyloxycarbonyl)-3-oxopropyl)phenyl 4-nitrobenzenesulfonate | CHEMBL404143
TypeSmall organic molecule
Emp. Form.C34H32N4O9S
Mol. Mass.672.704
SMILES[O-][N+](=O)c1ccc(cc1)S(=O)(=O)Oc1ccc(C[C@H](NC(=O)OCc2ccccc2)C(=O)N2CCN(CC2)C(=O)c2ccccc2)cc1