Reaction Details
TargetP2X purinoceptor 7
LigandBDBM50075458
Substrate/Competitorn/a
Meas. Tech.ChEMBL_1473820 (CHEMBL3418719)
IC50 29±n/a nM
Citation Park, JHLee, GELee, SDHien, TTKim, SYang, JWCho, JHKo, HLim, SCKim, YGKang, KWKim, YC Discovery of novel 2,5-dioxoimidazolidine-based P2X(7) receptor antagonists as constrained analogues of KN62. J Med Chem58:2114-34 (2015) 
 
P2X purinoceptor 7
Name:P2X purinoceptor 7
Type:Protein
Mol. Mass.:68602.85
Organism:Homo sapiens (Human)
Description:Q99572
Residue:595
BDBM50075458
NameBDBM50075458
Synonyms:CHEMBL3415334
TypeSmall organic molecule
Emp. Form.C33H36N4O6S
Mol. Mass.616.727
SMILESO=C(CC1CC2CCC1C2)N1CCC(CC1)N1C(Cc2ccc(OS(=O)(=O)c3cccc4cnccc34)cc2)C(=O)NC1=O