Reaction Details
TargetLysine-specific histone demethylase 1A
LigandBDBM50075568
Substrate/Competitorn/a
Meas. Tech.ChEMBL_1473012 (CHEMBL3420662)
IC50 1660±n/a nM
Citation Ma, LYZheng, YCWang, SQWang, BWang, ZRPang, LPZhang, MWang, JWDing, LLi, JWang, CHu, BLiu, YZhang, XDWang, JJWang, ZJZhao, WLiu, HM Design, synthesis, and structure-activity relationship of novel LSD1 inhibitors based on pyrimidine-thiourea hybrids as potent, orally active antitumor agents. J Med Chem58:1705-16 (2015) 
 
Lysine-specific histone demethylase 1A
Name:Lysine-specific histone demethylase 1A
Type:Enzyme
Mol. Mass.:92901.01
Organism:Homo sapiens (Human)
Description:O60341
Residue:852
BDBM50075568
NameBDBM50075568
Synonyms:CHEMBL3415358
TypeSmall organic molecule
Emp. Form.C15H10F2N6S2
Mol. Mass.376.407
SMILESNC(=S)NNc1nc(SCC#C)nc(-c2ccc(F)c(F)c2)c1C#N