Reaction Details
TargetAcetylcholinesterase
LigandBDBM50075590
Substrate/Competitorn/a
Meas. Tech.ChEMBL_1473459 (CHEMBL3419741)
IC50 3167±n/a nM
Citation Guzior, NBajda, MSkrok, MKurpiewska, KLewinski, KBrus, BPi?lar, AKos, JGobec, SMalawska, B Development of multifunctional, heterodimeric isoindoline-1,3-dione derivatives as cholinesterase andß-amyloid aggregation inhibitors with neuroprotective properties. Eur J Med Chem92:738-49 (2015) 
 
Acetylcholinesterase
Name:Acetylcholinesterase
Type:Enzyme
Mol. Mass.:67792.70
Organism:Homo sapiens (Human)
Description:P22303
Residue:614
BDBM50075590
NameBDBM50075590
Synonyms:CHEMBL3415569
TypeSmall organic molecule
Emp. Form.C21H23FN2O2
Mol. Mass.354.4179
SMILESFc1ccc(CNCCCCCCN2C(=O)c3ccccc3C2=O)cc1