Reaction Details
TargetSerine/threonine-protein kinase Chk2
LigandBDBM50075731
Substrate/Competitorn/a
Meas. Tech.ChEMBL_1473798 (CHEMBL3418523)
IC50 160±n/a nM
Citation Ellis, JMAltman, MDBass, AButcher, JWByford, AJDonofrio, AGalloway, SHaidle, AMJewell, JKelly, NLeccese, EKLee, SMaddess, MMiller, JRMoy, LYOsimboni, EOtte, RDReddy, MVSpencer, KSun, BVincent, SHWard, GJWoo, GHYang, CHoushyar, HNorthrup, AB Overcoming mutagenicity and ion channel activity: optimization of selective spleen tyrosine kinase inhibitors. J Med Chem58:1929-39 (2015) 
 
Serine/threonine-protein kinase Chk2
Name:Serine/threonine-protein kinase Chk2
Type:Protein
Mol. Mass.:60908.59
Organism:Homo sapiens (Human)
Description:O96017
Residue:543
BDBM50075731
NameBDBM50075731
Synonyms:CHEMBL3415608
TypeSmall organic molecule
Emp. Form.C19H22N6O
Mol. Mass.350.4176
SMILESN[C@H]1CCCC[C@H]1Nc1cnc(C(N)=O)c(c1)-c1nc2ccccc2[nH]1