Reaction Details
TargetTestis-specific serine/threonine-protein kinase 3
LigandBDBM50075731
Substrate/Competitorn/a
Meas. Tech.ChEMBL_1473799 (CHEMBL3418524)
IC50 420±n/a nM
Citation Ellis, JMAltman, MDBass, AButcher, JWByford, AJDonofrio, AGalloway, SHaidle, AMJewell, JKelly, NLeccese, EKLee, SMaddess, MMiller, JRMoy, LYOsimboni, EOtte, RDReddy, MVSpencer, KSun, BVincent, SHWard, GJWoo, GHYang, CHoushyar, HNorthrup, AB Overcoming mutagenicity and ion channel activity: optimization of selective spleen tyrosine kinase inhibitors. J Med Chem58:1929-39 (2015) 
 
Testis-specific serine/threonine-protein kinase 3
Name:Testis-specific serine/threonine-protein kinase 3
Type:PROTEIN
Mol. Mass.:30102.61
Organism:Homo sapiens (Human)
Description:ChEMBL_109599
Residue:268
BDBM50075731
NameBDBM50075731
Synonyms:CHEMBL3415608
TypeSmall organic molecule
Emp. Form.C19H22N6O
Mol. Mass.350.4176
SMILESN[C@H]1CCCC[C@H]1Nc1cnc(C(N)=O)c(c1)-c1nc2ccccc2[nH]1