Reaction Details
TargetPotassium voltage-gated channel subfamily H member 2
LigandBDBM50075733
Substrate/Competitorn/a
Meas. Tech.ChEMBL_1473800 (CHEMBL3418525)
IC50 22000±n/a nM
Citation Ellis, JMAltman, MDBass, AButcher, JWByford, AJDonofrio, AGalloway, SHaidle, AMJewell, JKelly, NLeccese, EKLee, SMaddess, MMiller, JRMoy, LYOsimboni, EOtte, RDReddy, MVSpencer, KSun, BVincent, SHWard, GJWoo, GHYang, CHoushyar, HNorthrup, AB Overcoming mutagenicity and ion channel activity: optimization of selective spleen tyrosine kinase inhibitors. J Med Chem58:1929-39 (2015) 
 
Potassium voltage-gated channel subfamily H member 2
Name:Potassium voltage-gated channel subfamily H member 2
Type:Multi-pass membrane protein
Mol. Mass.:126672.65
Organism:Homo sapiens (Human)
Description:Q12809
Residue:1159
BDBM50075733
NameBDBM50075733
Synonyms:CHEMBL3415610 | US9775839, 8.5
TypeSmall organic molecule
Emp. Form.C19H22N6O3
Mol. Mass.382.4164
SMILESCOc1cccc2[nH]c(cc12)-c1nc(N[C@@H]2CCOC[C@@H]2N)cnc1C(N)=O