Reaction Details
TargetPotassium voltage-gated channel subfamily H member 2
LigandBDBM50075746
Substrate/Competitorn/a
Meas. Tech.ChEMBL_1473800 (CHEMBL3418525)
IC50 6500±n/a nM
Citation Ellis, JMAltman, MDBass, AButcher, JWByford, AJDonofrio, AGalloway, SHaidle, AMJewell, JKelly, NLeccese, EKLee, SMaddess, MMiller, JRMoy, LYOsimboni, EOtte, RDReddy, MVSpencer, KSun, BVincent, SHWard, GJWoo, GHYang, CHoushyar, HNorthrup, AB Overcoming mutagenicity and ion channel activity: optimization of selective spleen tyrosine kinase inhibitors. J Med Chem58:1929-39 (2015) 
 
Potassium voltage-gated channel subfamily H member 2
Name:Potassium voltage-gated channel subfamily H member 2
Type:Multi-pass membrane protein
Mol. Mass.:126672.65
Organism:Homo sapiens (Human)
Description:Q12809
Residue:1159
BDBM50075746
NameBDBM50075746
Synonyms:CHEMBL3415596
TypeSmall organic molecule
Emp. Form.C21H30N6O2
Mol. Mass.398.5019
SMILESCc1cc(cc(Nc2cc(N[C@@H]3CCCC[C@@H]3N)cnc2C(N)=O)n1)C(C)(C)O