Reaction Details
TargetReverse transcriptase
LigandBDBM33409
Substrate/Competitorn/a
Meas. Tech.ChEMBL_1473838 (CHEMBL3418915)
IC50 3200±n/a nM
Citation Cuzzucoli Crucitti, GMétifiot, MPescatori, LMessore, AMadia, VNPupo, GSaccoliti, FScipione, LTortorella, SEsposito, FCorona, ACadeddu, MMarchand, CPommier, YTramontano, ECosti, RDi Santo, R Structure-activity relationship of pyrrolyl diketo acid derivatives as dual inhibitors of HIV-1 integrase and reverse transcriptase ribonuclease H domain. J Med Chem58:1915-28 (2015) 
 
Reverse transcriptase
Name:Reverse transcriptase
Synonyms:n/a
Type:Protein
Mol. Mass.:29598.37
Organism:Human immunodeficiency virus 1
Description:Q9WKE8
Residue:254
BDBM33409
NameBDBM33409
Synonyms:alpha, gamma-diketo acid, 1
TypeSmall organic molecule
Emp. Form.C15H11NO5S
Mol. Mass.317.317
SMILESOC(=O)C(=O)CC(=O)c1ccc(NC(=O)c2ccccc2)s1