Reaction Details
TargetTyrosine-protein kinase ZAP-70
LigandBDBM50400047
Substrate/Competitorn/a
Meas. Tech.ChEMBL_1473914 (CHEMBL3419165)
IC50 1805±n/a nM
Citation Thoma, GSmith, ABvan Eis, MJVangrevelinghe, EBlanz, JAichholz, RLittlewood-Evans, ALee, CCLiu, HZerwes, HG Discovery and profiling of a selective and efficacious Syk inhibitor. J Med Chem58:1950-63 (2015) 
 
Tyrosine-protein kinase ZAP-70
Name:Tyrosine-protein kinase ZAP-70
Type:Enzyme
Mol. Mass.:69881.61
Organism:Homo sapiens (Human)
Description:ZAP-70 SH2 domain was expressed and purified from E. coli using O-phospho-L-tyrosine-agarose column.
Residue:619
BDBM50400047
NameBDBM50400047
Synonyms:BIIB-057 US9579320, Example 87
TypeSmall organic molecule
Emp. Form.C19H23N9O
Mol. Mass.393.4456
SMILESN[C@H]1CCCC[C@H]1Nc1ncc(C(N)=O)c(Nc2cccc(c2)-n2nccn2)n1