Reaction Details
TargetTyrosine-protein kinase SYK
LigandBDBM50076188
Substrate/Competitorn/a
Meas. Tech.ChEMBL_1473873 (CHEMBL3418950)
IC50 274±n/a nM
Citation Thoma, GSmith, ABvan Eis, MJVangrevelinghe, EBlanz, JAichholz, RLittlewood-Evans, ALee, CCLiu, HZerwes, HG Discovery and profiling of a selective and efficacious Syk inhibitor. J Med Chem58:1950-63 (2015) 
 
Tyrosine-protein kinase SYK
Name:Tyrosine-protein kinase SYK
Type:Enzyme
Mol. Mass.:72079.99
Organism:Homo sapiens (Human)
Description:P43405
Residue:635
BDBM50076188
NameBDBM50076188
Synonyms:CHEMBL3416025
TypeSmall organic molecule
Emp. Form.C18H22N10O
Mol. Mass.394.4337
SMILESN[C@H]1CCCC[C@H]1Nc1nnc(C(N)=O)c(Nc2cccc(c2)-n2nccn2)n1