Reaction Details
TargetTyrosine-protein kinase SYK
LigandBDBM50076192
Substrate/Competitorn/a
Meas. Tech.ChEMBL_1473872 (CHEMBL3418949)
IC50 445±n/a nM
Citation Thoma, GSmith, ABvan Eis, MJVangrevelinghe, EBlanz, JAichholz, RLittlewood-Evans, ALee, CCLiu, HZerwes, HG Discovery and profiling of a selective and efficacious Syk inhibitor. J Med Chem58:1950-63 (2015) 
 
Tyrosine-protein kinase SYK
Name:Tyrosine-protein kinase SYK
Type:Enzyme
Mol. Mass.:72079.99
Organism:Homo sapiens (Human)
Description:P43405
Residue:635
BDBM50076192
NameBDBM50076192
Synonyms:CHEMBL3416021
TypeSmall organic molecule
Emp. Form.C20H24N8O
Mol. Mass.392.4576
SMILESN[C@H]1CCCC[C@H]1Nc1ccc(C(N)=O)c(Nc2cccc(c2)-n2nccn2)n1