Reaction Details
TargetTyrosine-protein kinase SYK
LigandBDBM50013160
Substrate/Competitorn/a
Meas. Tech.ChEMBL_1473872 (CHEMBL3418949)
IC50 778±n/a nM
Citation Thoma, GSmith, ABvan Eis, MJVangrevelinghe, EBlanz, JAichholz, RLittlewood-Evans, ALee, CCLiu, HZerwes, HG Discovery and profiling of a selective and efficacious Syk inhibitor. J Med Chem58:1950-63 (2015) 
 
Tyrosine-protein kinase SYK
Name:Tyrosine-protein kinase SYK
Type:Enzyme
Mol. Mass.:72079.99
Organism:Homo sapiens (Human)
Description:P43405
Residue:635
BDBM50013160
NameBDBM50013160
Synonyms:CHEMBL3262355
TypeSmall organic molecule
Emp. Form.C21H23N9O
Mol. Mass.417.467
SMILESN[C@H]1CCCC[C@H]1Nc1cc2nc[nH]c(=O)c2c(Nc2cccc(c2)-n2nccn2)n1