Reaction Details
TargetTyrosine-protein kinase SYK
LigandBDBM50015448
Substrate/Competitorn/a
Meas. Tech.ChEMBL_1473872 (CHEMBL3418949)
IC50 878±n/a nM
Citation Thoma, GSmith, ABvan Eis, MJVangrevelinghe, EBlanz, JAichholz, RLittlewood-Evans, ALee, CCLiu, HZerwes, HG Discovery and profiling of a selective and efficacious Syk inhibitor. J Med Chem58:1950-63 (2015) 
 
Tyrosine-protein kinase SYK
Name:Tyrosine-protein kinase SYK
Type:Enzyme
Mol. Mass.:72079.99
Organism:Homo sapiens (Human)
Description:P43405
Residue:635
BDBM50015448
NameBDBM50015448
Synonyms:CHEMBL3265032
TypeSmall organic molecule
Emp. Form.C23H21N7O
Mol. Mass.411.4591
SMILESC1CN(CCO1)c1ccc(Nc2nc(cn3ccnc23)-c2ccc3cn[nH]c3c2)cc1