Reaction Details
TargetTyrosine-protein kinase SYK
LigandBDBM50013172
Substrate/Competitorn/a
Meas. Tech.ChEMBL_1473870 (CHEMBL3418947)
IC50 22±n/a nM
Citation Thoma, GSmith, ABvan Eis, MJVangrevelinghe, EBlanz, JAichholz, RLittlewood-Evans, ALee, CCLiu, HZerwes, HG Discovery and profiling of a selective and efficacious Syk inhibitor. J Med Chem58:1950-63 (2015) 
 
Tyrosine-protein kinase SYK
Name:Tyrosine-protein kinase SYK
Type:Enzyme
Mol. Mass.:72079.99
Organism:Homo sapiens (Human)
Description:P43405
Residue:635
BDBM50013172
NameBDBM50013172
Synonyms:CHEMBL3262624
TypeSmall organic molecule
Emp. Form.C21H22N6O2
Mol. Mass.390.4384
SMILESN[C@H]1COCC[C@H]1Nc1cc2cc[nH]c(=O)c2c(Nc2cccc3cc[nH]c23)n1