Reaction Details
TargetAldehyde dehydrogenase 1A1
LigandBDBM50076550
Substrate/Competitorn/a
Meas. Tech.ChEMBL_1473980 (CHEMBL3419576)
IC50 210±n/a nM
Citation Morgan, CAHurley, TD Characterization of two distinct structural classes of selective aldehyde dehydrogenase 1A1 inhibitors. J Med Chem58:1964-75 (2015) 
 
Aldehyde dehydrogenase 1A1
Name:Aldehyde dehydrogenase 1A1
Type:Protein
Mol. Mass.:54862.21
Organism:Homo sapiens (Human)
Description:n/a
Residue:501
BDBM50076550
NameBDBM50076550
Synonyms:CHEMBL3416554
TypeSmall organic molecule
Emp. Form.C19H30N6O3
Mol. Mass.390.4799
SMILESCC(C)CCn1c(CN2CCC(CC2)C(N)=O)nc2n(C)c(=O)n(C)c(=O)c12