Reaction Details
TargetAldehyde dehydrogenase 1A1
LigandBDBM50076690
Substrate/Competitorn/a
Meas. Tech.ChEMBL_1473980 (CHEMBL3419576)
IC50>20000±n/a nM
Citation Morgan, CAHurley, TD Characterization of two distinct structural classes of selective aldehyde dehydrogenase 1A1 inhibitors. J Med Chem58:1964-75 (2015) 
 
Aldehyde dehydrogenase 1A1
Name:Aldehyde dehydrogenase 1A1
Type:Protein
Mol. Mass.:54862.21
Organism:Homo sapiens (Human)
Description:n/a
Residue:501
BDBM50076690
NameBDBM50076690
Synonyms:CHEMBL2360124
TypeSmall organic molecule
Emp. Form.C18H20FN5O3
Mol. Mass.373.3815
SMILESCn1c2nc(N3CCOCC3)n(Cc3ccccc3F)c2c(=O)n(C)c1=O