Reaction Details
TargetRetinal dehydrogenase 2
LigandBDBM50076552
Substrate/Competitorn/a
Meas. Tech.ChEMBL_1473077 (CHEMBL3421187)
IC50>100000±n/a nM
Citation Morgan, CAHurley, TD Characterization of two distinct structural classes of selective aldehyde dehydrogenase 1A1 inhibitors. J Med Chem58:1964-75 (2015) 
 
Retinal dehydrogenase 2
Name:Retinal dehydrogenase 2
Type:PROTEIN
Mol. Mass.:56720.77
Organism:Homo sapiens (Human)
Description:ChEMBL_109700
Residue:518
BDBM50076552
NameBDBM50076552
Synonyms:CHEMBL1311611
TypeSmall organic molecule
Emp. Form.C21H29N5O2
Mol. Mass.383.4873
SMILESCC(C)CCn1c(CN(C)Cc2ccccc2)nc2n(C)c(=O)n(C)c(=O)c12