Reaction Details
TargetAldehyde dehydrogenase, mitochondrial
LigandBDBM50076740
Substrate/Competitorn/a
Meas. Tech.ChEMBL_1473081 (CHEMBL3421191)
IC50>100000±n/a nM
Citation Morgan, CAHurley, TD Characterization of two distinct structural classes of selective aldehyde dehydrogenase 1A1 inhibitors. J Med Chem58:1964-75 (2015) 
 
Aldehyde dehydrogenase, mitochondrial
Name:Aldehyde dehydrogenase, mitochondrial
Type:Enzyme
Mol. Mass.:56382.67
Organism:Homo sapiens (Human)
Description:P05091
Residue:517
BDBM50076740
NameBDBM50076740
Synonyms:CHEMBL1382328
TypeSmall organic molecule
Emp. Form.C23H30N6O3
Mol. Mass.438.5227
SMILESCn1c2nc(CN3CCC(CC3)C(N)=O)n(CCCc3ccccc3)c2c(=O)n(C)c1=O