Reaction Details
TargetEndoplasmic reticulum aminopeptidase 1
LigandBDBM50076744
Substrate/Competitorn/a
Meas. Tech.ChEMBL_1473167 (CHEMBL3418219)
IC50 33±n/a nM
Citation Papakyriakou, AZervoudi, ETsoukalidou, SMauvais, FXSfyroera, GMastellos, DCvan Endert, PTheodorakis, EAVourloumis, DStratikos, E 3,4-diaminobenzoic acid derivatives as inhibitors of the oxytocinase subfamily of M1 aminopeptidases with immune-regulating properties. J Med Chem58:1524-43 (2015) 
 
Endoplasmic reticulum aminopeptidase 1
Name:Endoplasmic reticulum aminopeptidase 1
Type:PROTEIN
Mol. Mass.:107232.03
Organism:Homo sapiens (Human)
Description:ChEMBL_1473167
Residue:941
BDBM50076744
NameBDBM50076744
Synonyms:CHEMBL3416733
TypeSmall organic molecule
Emp. Form.C27H37N4O4P
Mol. Mass.512.5808
SMILESCC(C)C[C@H](CP(O)(=O)[C@@H](N)CCc1ccccc1)C(=O)N[C@@H](Cc1c[nH]c2ccccc12)C(N)=O