Reaction Details
TargetOxytocin receptor
LigandBDBM50077141
Substrate/Competitorn/a
Meas. Tech.ChEMBL_1474015 (CHEMBL3419775)
Ki 0.450000±n/a nM
Citation Karpenko, IAMargathe, JFRodriguez, TPflimlin, EDupuis, EHibert, MDurroux, TBonnet, D Selective nonpeptidic fluorescent ligands for oxytocin receptor: design, synthesis, and application to time-resolved FRET binding assay. J Med Chem58:2547-52 (2015) 
 
Oxytocin receptor
Name:Oxytocin receptor
Type:Enzyme Catalytic Domain
Mol. Mass.:42793.26
Organism:Homo sapiens (Human)
Description:Oxytocin OXTR HEK293::B2R9L7
Residue:389
BDBM50077141
NameBDBM50077141
Synonyms:CHEMBL3416758
TypeSmall organic molecule
Emp. Form.C57H78N12O13S2
Mol. Mass.1203.432
SMILES[H][C@]1(NC(=O)[C@H](Cc2ccccc2)NC(=O)[C@H](Cc2ccc(OC)cc2)NC(=O)C(N)C2(CCCCC2)SSC[C@H](NC(=O)[C@H](CC(N)=O)NC1=O)C(=O)N1CCC[C@H]1C(=O)N[C@@H](CCCN)C(=O)N[C@@H](Cc1ccc(O)cc1)C(N)=O)[C@@H](C)O