Reaction Details
TargetSphingosine kinase 1
LigandBDBM50077143
Substrate/Competitorn/a
Meas. Tech.ChEMBL_1474026 (CHEMBL3419997)
Ki>10000±n/a nM
Citation Patwardhan, NNMorris, EAKharel, YRaje, MRGao, MTomsig, JLLynch, KRSantos, WL Structure-activity relationship studies and in vivo activity of guanidine-based sphingosine kinase inhibitors: discovery of SphK1- and SphK2-selective inhibitors. J Med Chem58:1879-99 (2015) 
 
Sphingosine kinase 1
Name:Sphingosine kinase 1
Type:Enzyme
Mol. Mass.:42521.16
Organism:Homo sapiens (Human)
Description:Q9NYA1
Residue:384
BDBM50077143
NameBDBM50077143
Synonyms:CHEMBL3416833
TypeSmall organic molecule
Emp. Form.C20H30ClN5O
Mol. Mass.391.938
SMILESCl.CCCCCCCCc1ccc(cc1)-c1noc(n1)[C@@H]1CCN1C(N)=N