Reaction Details
TargetSphingosine kinase 2
LigandBDBM50443389
Substrate/Competitorn/a
Meas. Tech.ChEMBL_1474027 (CHEMBL3419998)
Ki>100000±n/a nM
Citation Patwardhan, NNMorris, EAKharel, YRaje, MRGao, MTomsig, JLLynch, KRSantos, WL Structure-activity relationship studies and in vivo activity of guanidine-based sphingosine kinase inhibitors: discovery of SphK1- and SphK2-selective inhibitors. J Med Chem58:1879-99 (2015) 
 
Sphingosine kinase 2
Name:Sphingosine kinase 2
Type:Protein
Mol. Mass.:69221.44
Organism:Homo sapiens (Human)
Description:Q9NRA0
Residue:654
BDBM50443389
NameBDBM50443389
Synonyms:CHEMBL2376441
TypeSmall organic molecule
Emp. Form.C17H27NO2
Mol. Mass.277.4018
SMILESCCCCCc1ccc(\C=C\[C@H](O)[C@@H](CO)NC)cc1