Reaction Details
TargetSphingosine kinase 2
LigandBDBM50312869
Substrate/Competitorn/a
Meas. Tech.ChEMBL_1474027 (CHEMBL3419998)
Ki 50000±n/a nM
Citation Patwardhan, NNMorris, EAKharel, YRaje, MRGao, MTomsig, JLLynch, KRSantos, WL Structure-activity relationship studies and in vivo activity of guanidine-based sphingosine kinase inhibitors: discovery of SphK1- and SphK2-selective inhibitors. J Med Chem58:1879-99 (2015) 
 
Sphingosine kinase 2
Name:Sphingosine kinase 2
Type:Protein
Mol. Mass.:69221.44
Organism:Homo sapiens (Human)
Description:Q9NRA0
Residue:654
BDBM50312869
NameBDBM50312869
Synonyms:4-(4-(4-chlorophenyl)thiazol-2-ylamino)phenol N-aryl-4-aryl-1,3-thiazole-2-amine, 5
TypeSmall organic molecule
Emp. Form.C15H11ClN2OS
Mol. Mass.302.779
SMILESOc1ccc(Nc2nc(cs2)-c2ccc(Cl)cc2)cc1