Reaction Details
TargetVasopressin V1a receptor
LigandBDBM50077219
Substrate/Competitorn/a
Meas. Tech.ChEMBL_1473358 (CHEMBL3419318)
Ki 11±n/a nM
Citation Ratni, HRogers-Evans, MBissantz, CGrundschober, CMoreau, JLSchuler, FFischer, HAlvarez Sanchez, RSchnider, P Discovery of highly selective brain-penetrant vasopressin 1a antagonists for the potential treatment of autism via a chemogenomic and scaffold hopping approach. J Med Chem58:2275-89 (2015) 
 
Vasopressin V1a receptor
Name:Vasopressin V1a receptor
Type:PROTEIN
Mol. Mass.:47202.75
Organism:Mus musculus
Description:ChEMBL_109593
Residue:423
BDBM50077219
NameBDBM50077219
Synonyms:CHEMBL3416884
TypeSmall organic molecule
Emp. Form.C27H30ClN3O2
Mol. Mass.463.999
SMILESCN1CCC(CC1)n1cc(C(=O)N2CCC3(CC2)OCc2ccccc32)c2ccc(Cl)cc12