Reaction Details
TargetVasopressin V1a receptor
LigandBDBM50077452
Substrate/Competitorn/a
Meas. Tech.ChEMBL_1473355 (CHEMBL3419315)
Ki 1.000000±n/a nM
Citation Ratni, HRogers-Evans, MBissantz, CGrundschober, CMoreau, JLSchuler, FFischer, HAlvarez Sanchez, RSchnider, P Discovery of highly selective brain-penetrant vasopressin 1a antagonists for the potential treatment of autism via a chemogenomic and scaffold hopping approach. J Med Chem58:2275-89 (2015) 
 
Vasopressin V1a receptor
Name:Vasopressin V1a receptor
Type:Receptor
Mol. Mass.:46820.18
Organism:Homo sapiens (Human)
Description:P37288
Residue:418
BDBM50077452
NameBDBM50077452
Synonyms:CHEMBL3416868
TypeSmall organic molecule
Emp. Form.C28H31ClN4O3
Mol. Mass.507.024
SMILESCN1CCN(CC1)C(=O)Cn1cc(C(=O)N2CCC3(CC2)OCc2ccccc32)c2ccc(Cl)cc12