Reaction Details
TargetSodium channel protein type 4 subunit alpha
LigandBDBM50077781
Substrate/Competitorn/a
Meas. Tech.ChEMBL_1473384 (CHEMBL3419344)
IC50 500±n/a nM
Citation Murray, JKLigutti, JLiu, DZou, APoppe, LLi, HAndrews, KLMoyer, BDMcDonough, SIFavreau, PStöcklin, RMiranda, LP Engineering potent and selective analogues of GpTx-1, a tarantula venom peptide antagonist of the Na(V)1.7 sodium channel. J Med Chem58:2299-314 (2015) 
 
Sodium channel protein type 4 subunit alpha
Name:Sodium channel protein type 4 subunit alpha
Type:Protein
Mol. Mass.:208010.01
Organism:Homo sapiens (Human)
Description:P35499
Residue:1836
BDBM50077781
NameBDBM50077781
Synonyms:CHEMBL3416942
TypeSmall organic molecule
Emp. Form.C178H269N53O45S6
Mol. Mass.4063.759
SMILES[H][C@@]12CCCN1C(=O)[C@H](CCCNC(N)=N)NC(=O)[C@]1([H])CSSC[C@H](NC(=O)[C@@H](N)CC(O)=O)C(=O)N[C@@H](CC(C)C)C(=O)NCC(=O)N[C@@H](C)C(=O)N[C@@H](Cc3cccc4ccccc34)C(=O)N[C@@H](CCCNC(N)=N)C(=O)N[C@@H](CCCCN)C(=O)N[C@@]3([H])CSSC[C@]([H])(NC(=O)[C@@H](NC(=O)[C@H](CC(C)C)NC(=O)[C@H](CC(N)=O)NC2=O)C(C)C)C(=O)N[C@@H](CO)C(=O)N[C@@H](CCCNC(N)=N)C(=O)N[C@@]([H])([C@@H](C)O)C(=O)N[C@@H](Cc2cnc[nH]2)C(=O)N[C@@H](CCCCN)C(=O)N[C@@H](Cc2c[nH]c4ccccc24)C(=O)N[C@@H](CSSC[C@]([H])(NC(=O)[C@H](CCCCN)NC(=O)[C@H](CC(O)=O)NC(=O)[C@H](CC(N)=O)NC(=O)[C@H](CC(O)=O)NC(=O)[C@]2([H])CCCN2C(=O)[C@@]([H])(NC3=O)[C@@H](C)CC)C(=O)N1)C(=O)N[C@@H](CCCCN)C(=O)N[C@@H](Cc1ccc(O)cc1)C(=O)N[C@@H](C(C)C)C(=O)N[C@@H](Cc1ccccc1)C(N)=O