Reaction Details
TargetC-C chemokine receptor type 2
LigandBDBM50077906
Substrate/Competitorn/a
Meas. Tech.ChEMBL_1473182 (CHEMBL3418234)
Ki 0.550000±n/a nM
Citation Vilums, MZweemer, AJBarmare, Fvan der Gracht, AMBleeker, DCYu, Zde Vries, HGross, RClemens, JKrenitsky, PBrussee, JStamos, DSaunders, JHeitman, LHIJzerman, AP When structure-affinity relationships meet structure-kinetics relationships: 3-((Inden-1-yl)amino)-1-isopropyl-cyclopentane-1-carboxamides as CCR2 antagonists. Eur J Med Chem93:121-34 (2015) 
 
C-C chemokine receptor type 2
Name:C-C chemokine receptor type 2
Type:Enzyme
Mol. Mass.:41932.32
Organism:Homo sapiens (Human)
Description:P41597
Residue:374
BDBM50077906
NameBDBM50077906
Synonyms:CHEMBL3305901
TypeSmall organic molecule
Emp. Form.C24H34F3N3O3
Mol. Mass.469.5403
SMILESCO[C@@H]1COCC[C@@H]1N[C@@H]1CC[C@](C1)(C(C)C)C(=O)N1CCc2ncc(cc2C1)C(F)(F)F