Reaction Details
TargetC-C chemokine receptor type 2
LigandBDBM50077908
Substrate/Competitorn/a
Meas. Tech.ChEMBL_1473182 (CHEMBL3418234)
Ki 2.4±n/a nM
Citation Vilums, MZweemer, AJBarmare, Fvan der Gracht, AMBleeker, DCYu, Zde Vries, HGross, RClemens, JKrenitsky, PBrussee, JStamos, DSaunders, JHeitman, LHIJzerman, AP When structure-affinity relationships meet structure-kinetics relationships: 3-((Inden-1-yl)amino)-1-isopropyl-cyclopentane-1-carboxamides as CCR2 antagonists. Eur J Med Chem93:121-34 (2015) 
 
C-C chemokine receptor type 2
Name:C-C chemokine receptor type 2
Type:Enzyme
Mol. Mass.:41932.32
Organism:Homo sapiens (Human)
Description:P41597
Residue:374
BDBM50077908
NameBDBM50077908
Synonyms:CHEMBL3417235
TypeSmall organic molecule
Emp. Form.C28H32BrF3N2O
Mol. Mass.549.466
SMILESCC(C)[C@@]1(CC[C@H](C1)N[C@@H]1CCc2cc(Br)ccc12)C(=O)N1CCc2ccc(cc2C1)C(F)(F)F