Reaction Details
TargetApelin receptor
LigandBDBM50077999
Substrate/Competitorn/a
Meas. Tech.ChEMBL_1471753 (CHEMBL3421345)
Ki 2.1±n/a nM
Citation Murza, ABesserer-Offroy, ÉCôté, JBérubé, PLongpré, JMDumaine, RLesur, OAuger-Messier, MLeduc, RSarret, PMarsault, É C-Terminal modifications of apelin-13 significantly change ligand binding, receptor signaling, and hypotensive action. J Med Chem58:2431-40 (2015) 
 
Apelin receptor
Name:Apelin receptor
Type:Enzyme Catalytic Domain
Mol. Mass.:42664.06
Organism:Homo sapiens (Human)
Description:P35414
Residue:380
BDBM50077999
NameBDBM50077999
Synonyms:CHEMBL3417291
TypeSmall organic molecule
Emp. Form.C70H110N22O16
Mol. Mass.1515.7602
SMILESCCCC[C@H](NC(=O)[C@@H]1CCCN1C(=O)CNC(=O)[C@H](CCCCN)NC(=O)[C@H](Cc1cnc[nH]1)NC(=O)[C@H](CO)NC(=O)[C@H](CC(C)C)NC(=O)[C@H](CCCNC(N)=N)NC(=O)[C@@H]1CCCN1C(=O)[C@H](CCCNC(N)=N)NC(=O)[C@@H]1CCC(=O)N1)C(=O)N1CCC[C@H]1C(=O)N[C@@H](Cc1ccccc1)C(O)=O