Reaction Details
TargetApoptosis regulator BAX
LigandBDBM50078026
Substrate/Competitorn/a
Meas. Tech.ChEMBL_1471766 (CHEMBL3417877)
Ki 1300±n/a nM
Citation Stornaiuolo, MLa Regina, GPassacantilli, SGrassia, GColuccia, ALa Pietra, VGiustiniano, MCassese, HDi Maro, SBrancaccio, DTaliani, SIalenti, ASilvestri, RMartini, CNovellino, EMarinelli, L Structure-based lead optimization and biological evaluation of BAX direct activators as novel potential anticancer agents. J Med Chem58:2135-48 (2015) 
 
Apoptosis regulator BAX
Name:Apoptosis regulator BAX
Type:PROTEIN
Mol. Mass.:21181.15
Organism:Homo sapiens (Human)
Description:ChEMBL_100916
Residue:192
BDBM50078026
NameBDBM50078026
Synonyms:CHEMBL3417406
TypeSmall organic molecule
Emp. Form.C24H23N5O3
Mol. Mass.429.4711
SMILESCCOc1ccccc1N\N=C1\C(C)=NN(C1=O)c1cc(O)cc(c1)-c1cccc(N)c1