Reaction Details
TargetArachidonate 5-lipoxygenase-activating protein
LigandBDBM50078038
Substrate/Competitorn/a
Meas. Tech.ChEMBL_1471925 (CHEMBL3420840)
IC50 2.4±n/a nM
Citation Takahashi, HRiether, DBartolozzi, ABosanac, TBerger, VBinetti, RBroadwater, JChen, ZCrux, RDe Lombaert, SDave, RDines, JAFadra-Khan, TFlegg, AGarrigou, MHao, MHHuber, JHutzler, JMKerr, SKotey, ALiu, WLo, HYLoke, PLMahaney, PEMorwick, TMNapier, SOlague, APack, EPadyana, AKThomson, DSTye, HWu, LZindell, RMAbeywardane, ASimpson, T Synthesis, SAR, and series evolution of novel oxadiazole-containing 5-lipoxygenase activating protein inhibitors: discovery of 2-[4-(3-{(r)-1-[4-(2-amino-pyrimidin-5-yl)-phenyl]-1-cyclopropyl-ethyl}-[1,2,4]oxadiazol-5-yl)-pyrazol-1-yl]-N,N-dimethyl-acetamide (BI 665915). J Med Chem58:1669-90 (2015) 
 
Arachidonate 5-lipoxygenase-activating protein
Name:Arachidonate 5-lipoxygenase-activating protein
Type:Enzyme
Mol. Mass.:18159.90
Organism:Homo sapiens (Human)
Description:P20292
Residue:161
BDBM50078038
NameBDBM50078038
Synonyms:CHEMBL3417427
TypeSmall organic molecule
Emp. Form.C19H17N7O
Mol. Mass.359.3846
SMILESNc1ncc(cn1)-c1ccc(cc1)C1(CCC1)c1noc(n1)-c1cc[nH]n1