Reaction Details
TargetArachidonate 5-lipoxygenase-activating protein
LigandBDBM50078077
Substrate/Competitorn/a
Meas. Tech.ChEMBL_1471925 (CHEMBL3420840)
IC50 2.0±n/a nM
Citation Takahashi, HRiether, DBartolozzi, ABosanac, TBerger, VBinetti, RBroadwater, JChen, ZCrux, RDe Lombaert, SDave, RDines, JAFadra-Khan, TFlegg, AGarrigou, MHao, MHHuber, JHutzler, JMKerr, SKotey, ALiu, WLo, HYLoke, PLMahaney, PEMorwick, TMNapier, SOlague, APack, EPadyana, AKThomson, DSTye, HWu, LZindell, RMAbeywardane, ASimpson, T Synthesis, SAR, and series evolution of novel oxadiazole-containing 5-lipoxygenase activating protein inhibitors: discovery of 2-[4-(3-{(r)-1-[4-(2-amino-pyrimidin-5-yl)-phenyl]-1-cyclopropyl-ethyl}-[1,2,4]oxadiazol-5-yl)-pyrazol-1-yl]-N,N-dimethyl-acetamide (BI 665915). J Med Chem58:1669-90 (2015) 
 
Arachidonate 5-lipoxygenase-activating protein
Name:Arachidonate 5-lipoxygenase-activating protein
Type:Enzyme
Mol. Mass.:18159.90
Organism:Homo sapiens (Human)
Description:P20292
Residue:161
BDBM50078077
NameBDBM50078077
Synonyms:CHEMBL3417517
TypeSmall organic molecule
Emp. Form.C21H23N7O
Mol. Mass.389.4536
SMILESCC(C)C(C)(c1noc(n1)-c1cnn(C)c1)c1ccc(cc1)-c1cnc(N)nc1