Reaction Details
TargetCannabinoid receptor 1
LigandBDBM50078148
Substrate/Competitorn/a
Meas. Tech.ChEMBL_1472104 (CHEMBL3418381)
Ki>40000±n/a nM
Citation Morales, PBlasco-Benito, SAndradas, CGómez-Cañas, MFlores, JMGoya, PFernández-Ruiz, JSánchez, CJagerovic, N Selective, nontoxic CB(2) cannabinoid o-quinone with in vivo activity against triple-negative breast cancer. J Med Chem58:2256-64 (2015) 
 
Cannabinoid receptor 1
Name:Cannabinoid receptor 1
Type:G Protein-Coupled Receptor (GPCR)
Mol. Mass.:52868.96
Organism:Homo sapiens (Human)
Description:P21554
Residue:472
BDBM50078148
NameBDBM50078148
Synonyms:CHEMBL3417565
TypeSmall organic molecule
Emp. Form.C22H30N2O3
Mol. Mass.370.4852
SMILESCCCCCCC(C)(C)C1=CC2=C(c3nn(C)cc3C(C)(C)O2)C(=O)C1=O