Reaction Details
TargetCannabinoid receptor 2
LigandBDBM50078148
Substrate/Competitorn/a
Meas. Tech.ChEMBL_1472105 (CHEMBL3418382)
Ki 597±n/a nM
Citation Morales, PBlasco-Benito, SAndradas, CGómez-Cañas, MFlores, JMGoya, PFernández-Ruiz, JSánchez, CJagerovic, N Selective, nontoxic CB(2) cannabinoid o-quinone with in vivo activity against triple-negative breast cancer. J Med Chem58:2256-64 (2015) 
 
Cannabinoid receptor 2
Name:Cannabinoid receptor 2
Type:G Protein-Coupled Receptor (GPCR)
Mol. Mass.:39690.94
Organism:Homo sapiens (Human)
Description:P34972
Residue:360
BDBM50078148
NameBDBM50078148
Synonyms:CHEMBL3417565
TypeSmall organic molecule
Emp. Form.C22H30N2O3
Mol. Mass.370.4852
SMILESCCCCCCC(C)(C)C1=CC2=C(c3nn(C)cc3C(C)(C)O2)C(=O)C1=O