Reaction Details
TargetAlbumin
LigandBDBM50078154
Substrate/Competitorn/a
Meas. Tech.ChEMBL_1472594 (CHEMBL3417959)
Ki 360±n/a nM
Citation Bruncko, MWang, LSheppard, GSPhillips, DCTahir, SKXue, JErickson, SFidanze, SFry, EHasvold, LJenkins, GJJin, SJudge, RAKovar, PJMadar, DNimmer, PPark, CPetros, AMRosenberg, SHSmith, MLSong, XSun, CTao, ZFWang, XXiao, YZhang, HTse, CLeverson, JDElmore, SWSouers, AJ Structure-guided design of a series of MCL-1 inhibitors with high affinity and selectivity. J Med Chem58:2180-94 (2015) 
 
Albumin
Name:Albumin
Type:PROTEIN
Mol. Mass.:69362.94
Organism:Homo sapiens (Human)
Description:ChEMBL_1509401
Residue:609
BDBM50078154
NameBDBM50078154
Synonyms:CHEMBL3417694
TypeSmall organic molecule
Emp. Form.C35H36N2O4
Mol. Mass.548.6713
SMILESCc1ccccc1-c1cccc2c(CCCOc3cccc4ccccc34)c(C(O)=O)n(CCN3CCOCC3)c12