Reaction Details
TargetInduced myeloid leukemia cell differentiation protein Mcl-1
LigandBDBM50078165
Substrate/Competitorn/a
Meas. Tech.ChEMBL_1472596 (CHEMBL3417961)
Ki 98±n/a nM
Citation Bruncko, MWang, LSheppard, GSPhillips, DCTahir, SKXue, JErickson, SFidanze, SFry, EHasvold, LJenkins, GJJin, SJudge, RAKovar, PJMadar, DNimmer, PPark, CPetros, AMRosenberg, SHSmith, MLSong, XSun, CTao, ZFWang, XXiao, YZhang, HTse, CLeverson, JDElmore, SWSouers, AJ Structure-guided design of a series of MCL-1 inhibitors with high affinity and selectivity. J Med Chem58:2180-94 (2015) 
 
Induced myeloid leukemia cell differentiation protein Mcl-1
Name:Induced myeloid leukemia cell differentiation protein Mcl-1
Type:Membrane; Single-pass membrane protein
Mol. Mass.:37332.87
Organism:Homo sapiens (Human)
Description:Q07820
Residue:350
BDBM50078165
NameBDBM50078165
Synonyms:CHEMBL3417706
TypeSmall organic molecule
Emp. Form.C46H46N6O5
Mol. Mass.762.8946
SMILESCC(=O)N1CCN(CC1)c1ccc(OCc2nn(C)c(C)c2-c2cccc3c(CCCOc4cccc5ccccc45)c(C(O)=O)n(Cc4cccnc4)c23)cc1