Reaction Details
TargetApoptosis regulator Bcl-2
LigandBDBM50078160
Substrate/Competitorn/a
Meas. Tech.ChEMBL_1472597 (CHEMBL3417962)
Ki>660±n/a nM
Citation Bruncko, MWang, LSheppard, GSPhillips, DCTahir, SKXue, JErickson, SFidanze, SFry, EHasvold, LJenkins, GJJin, SJudge, RAKovar, PJMadar, DNimmer, PPark, CPetros, AMRosenberg, SHSmith, MLSong, XSun, CTao, ZFWang, XXiao, YZhang, HTse, CLeverson, JDElmore, SWSouers, AJ Structure-guided design of a series of MCL-1 inhibitors with high affinity and selectivity. J Med Chem58:2180-94 (2015) 
 
Apoptosis regulator Bcl-2
Name:Apoptosis regulator Bcl-2
Type:Homodimer or heterodimer
Mol. Mass.:26269.11
Organism:Homo sapiens (Human)
Description:P10415
Residue:239
BDBM50078160
NameBDBM50078160
Synonyms:CHEMBL3417701
TypeSmall organic molecule
Emp. Form.C45H52N6O7S
Mol. Mass.820.995
SMILESCc1nn(C)c(COc2ccc(cc2)N2CCN(CC2)S(C)(=O)=O)c1-c1cccc2c(CCCOc3cccc4ccccc34)c(C(O)=O)n(CCN3CCOCC3)c12