Reaction Details
TargetInduced myeloid leukemia cell differentiation protein Mcl-1
LigandBDBM50078166
Substrate/Competitorn/a
Meas. Tech.ChEMBL_1472606 (CHEMBL3417971)
Ki 4400±n/a nM
Citation Bruncko, MWang, LSheppard, GSPhillips, DCTahir, SKXue, JErickson, SFidanze, SFry, EHasvold, LJenkins, GJJin, SJudge, RAKovar, PJMadar, DNimmer, PPark, CPetros, AMRosenberg, SHSmith, MLSong, XSun, CTao, ZFWang, XXiao, YZhang, HTse, CLeverson, JDElmore, SWSouers, AJ Structure-guided design of a series of MCL-1 inhibitors with high affinity and selectivity. J Med Chem58:2180-94 (2015) 
 
Induced myeloid leukemia cell differentiation protein Mcl-1
Name:Induced myeloid leukemia cell differentiation protein Mcl-1
Type:Membrane; Single-pass membrane protein
Mol. Mass.:37332.87
Organism:Homo sapiens (Human)
Description:Q07820
Residue:350
BDBM50078166
NameBDBM50078166
Synonyms:CHEMBL3417580
TypeSmall organic molecule
Emp. Form.C19H25NO2
Mol. Mass.299.4073
SMILESOC(=O)c1[nH]c2ccccc2c1CCCCC1CCCCC1